Target
Adenosine receptor A3
Ligand
BDBM50190435
Substrate
Meas. Tech.
ChEMBL_375257 (CHEMBL867484)
Ki
19±n/a nM
Citation
 Tafi, ABernardini, CBotta, MCorelli, FAndreini, MMartinelli, AOrtore, GBaraldi, PGFruttarolo, FBorea, PATuccinardi, T Pharmacophore based receptor modeling: the case of adenosine A3 receptor antagonists. An approach to the optimization of protein models. J Med Chem 49:4085-97 (2006)  
Target
Name:
Adenosine receptor A3
Synonyms:
A3 adenosine receptor (hA3) ADORA3 | Adenosine A3 receptor (A3AR)
Type:
G Protein-Coupled Receptor (GPCR)
Mol. Mass.:
36197.32
Organism:
Homo sapiens (Human)
Description:
P0DMS8
Residue:
318
  
Inhibitor
Name:
BDBM50190435
Synonyms:
3-ethyl 5-propyl 2-ethyl-6-phenyl-4-propylpyridine-3,5-dicarboxylate | CHEMBL209048
Type:
Small organic molecule
Emp. Form.:
C23H29NO4
Mol. Mass.:
383.4807
SMILES:
CCCOC(=O)c1c(CCC)c(C(=O)OCC)c(CC)nc1-c1ccccc1
: