Target
Adenosine receptor A3
Ligand
BDBM50067111
Substrate
Meas. Tech.
ChEMBL_375257 (CHEMBL867484)
Ki
96±n/a nM
Citation
 Tafi, ABernardini, CBotta, MCorelli, FAndreini, MMartinelli, AOrtore, GBaraldi, PGFruttarolo, FBorea, PATuccinardi, T Pharmacophore based receptor modeling: the case of adenosine A3 receptor antagonists. An approach to the optimization of protein models. J Med Chem 49:4085-97 (2006)  
Target
Name:
Adenosine receptor A3
Synonyms:
A3 adenosine receptor (hA3) ADORA3 | Adenosine A3 receptor (A3AR)
Type:
G Protein-Coupled Receptor (GPCR)
Mol. Mass.:
36197.32
Organism:
Homo sapiens (Human)
Description:
P0DMS8
Residue:
318
  
Inhibitor
Name:
BDBM50067111
Synonyms:
4-Methyl-N-(3-pyridin-2-yl-isoquinolin-1-yl)-benzamide CHEMBL339261
Type:
Small organic molecule
Emp. Form.:
C22H17N3O
Mol. Mass.:
339.3899
SMILES:
Cc1ccc(cc1)C(=O)Nc1nc(cc2ccccc12)-c1ccccn1
: