Target
Adenosine receptor A3
Ligand
BDBM50109478
Substrate
Meas. Tech.
ChEMBL_375257 (CHEMBL867484)
Ki
30±n/a nM
Citation
 Tafi, ABernardini, CBotta, MCorelli, FAndreini, MMartinelli, AOrtore, GBaraldi, PGFruttarolo, FBorea, PATuccinardi, T Pharmacophore based receptor modeling: the case of adenosine A3 receptor antagonists. An approach to the optimization of protein models. J Med Chem 49:4085-97 (2006)  
Target
Name:
Adenosine receptor A3
Synonyms:
A3 adenosine receptor (hA3) ADORA3 | Adenosine A3 receptor (A3AR)
Type:
G Protein-Coupled Receptor (GPCR)
Mol. Mass.:
36197.32
Organism:
Homo sapiens (Human)
Description:
P0DMS8
Residue:
318
  
Inhibitor
Name:
BDBM50109478
Synonyms:
4-(3-(2-(furan-2-yl)-8-propyl-8H-pyrazolo[4,3-e][1,2,4]triazolo[1,5-c]pyrimidin-5-yl)ureido)benzenesulfonic acid CHEMBL350573
Type:
Small organic molecule
Emp. Form.:
C20H18N8O5S
Mol. Mass.:
482.473
SMILES:
CCCn1cc2c(n1)nc(NC(=O)Nc1ccc(cc1)S(O)(=O)=O)n1nc(nc21)-c1ccco1
: