Target
Amiloride-sensitive sodium channel subunit alpha
Ligand
BDBM50190473
Substrate
Meas. Tech.
ChEMBL_375179 (CHEMBL868533)
IC50
107±n/a nM
Citation
 Hirsh, AJMolino, BFZhang, JAstakhova, NGeiss, WBSargent, BJSwenson, BDUsyatinsky, AWyle, MJBoucher, RCSmith, RTZamurs, AJohnson, MR Design, synthesis, and structure-activity relationships of novel 2-substituted pyrazinoylguanidine epithelial sodium channel blockers: drugs for cystic fibrosis and chronic bronchitis. J Med Chem 49:4098-115 (2006)  
Target
Name:
Amiloride-sensitive sodium channel subunit alpha
Synonyms:
Alpha-ENaC Amiloride-sensitive sodium channel alpha-subunit Epithelial Na(+) channel subunit alpha SCNEA SCNN1A | SCNNA_HUMAN
Type:
PROTEIN
Mol. Mass.:
75711.44
Organism:
Homo sapiens (Human)
Description:
ChEMBL_375179
Residue:
669
  
Inhibitor
Name:
BDBM50190473
Synonyms:
CHEMBL377688 | N-(3,5-diamino-6-chloropyrazine-2-carbonyl)-N'-(2-hydroxyethyl)guanidine
Type:
Small organic molecule
Emp. Form.:
C8H12ClN7O2
Mol. Mass.:
273.68
SMILES:
NC(NC(=O)c1nc(Cl)c(N)nc1N)=NCCO
: