Target
RNA-directed RNA polymerase
Ligand
BDBM50190959
Substrate
Meas. Tech.
ChEMBL_400597 (CHEMBL853550)
IC50
48000±n/a nM
Citation
 Li, HTatlock, JLinton, AGonzalez, JBorchardt, ADragovich, PJewell, TPrins, TZhou, RBlazel, JParge, HLove, RHickey, MDoan, CShi, SDuggal, RLewis, CFuhrman, S Identification and structure-based optimization of novel dihydropyrones as potent HCV RNA polymerase inhibitors. Bioorg Med Chem Lett 16:4834-8 (2006)  
Target
Name:
RNA-directed RNA polymerase
Synonyms:
Hepatitis C virus NS5B RNA-dependent RNA polymerase | NS5B protein
Type:
Protein
Mol. Mass.:
25173.95
Organism:
Hepatitis C virus
Description:
Q8JXU8
Residue:
229
  
Inhibitor
Name:
BDBM50190959
Synonyms:
6-cyclopentyl-6-phenethyl-dihydro-3H-pyran-2,4-dione | CHEMBL214680
Type:
Small organic molecule
Emp. Form.:
C18H22O3
Mol. Mass.:
286.3655
SMILES:
O=C1CC(=O)OC(CCc2ccccc2)(C1)C1CCCC1
: