Target
RNA-directed RNA polymerase
Ligand
BDBM50190968
Substrate
Meas. Tech.
ChEMBL_400597 (CHEMBL853550)
IC50
530±n/a nM
Citation
 Li, HTatlock, JLinton, AGonzalez, JBorchardt, ADragovich, PJewell, TPrins, TZhou, RBlazel, JParge, HLove, RHickey, MDoan, CShi, SDuggal, RLewis, CFuhrman, S Identification and structure-based optimization of novel dihydropyrones as potent HCV RNA polymerase inhibitors. Bioorg Med Chem Lett 16:4834-8 (2006)  
Target
Name:
RNA-directed RNA polymerase
Synonyms:
Hepatitis C virus NS5B RNA-dependent RNA polymerase | NS5B protein
Type:
Protein
Mol. Mass.:
25173.95
Organism:
Hepatitis C virus
Description:
Q8JXU8
Residue:
229
  
Inhibitor
Name:
BDBM50190968
Synonyms:
6-(3-fluoro-4-isopropoxyphenethyl)-6-cyclopentyl-dihydro-3H-pyran-2,4-dione | CHEMBL214171
Type:
Small organic molecule
Emp. Form.:
C21H27FO4
Mol. Mass.:
362.4351
SMILES:
CC(C)Oc1ccc(CCC2(CC(=O)CC(=O)O2)C2CCCC2)cc1F
: