Target
Melanocortin receptor 4
Ligand
BDBM50191026
Substrate
Meas. Tech.
ChEMBL_397859 (CHEMBL856320)
Ki
>10000±n/a nM
Citation
 Chen, CWTran, JAJiang, WTucci, FCArellano, MWen, JFleck, BAMarinkovic, DWhite, NSPontillo, JSaunders, JMadan, AFoster, ACChen, C Propionylpiperazines as human melanocortin-4 receptor ligands. Bioorg Med Chem Lett 16:4800-3 (2006)  
Target
Name:
Melanocortin receptor 4
Synonyms:
MC4-R MC4R_HUMAN Melanocortin receptor 4 (MC-4) Melanocortin receptor 4 (MC4R)
Type:
Enzyme
Mol. Mass.:
36949.50
Organism:
Homo sapiens (Human)
Description:
P32245
Residue:
332
  
Inhibitor
Name:
BDBM50191026
Synonyms:
(S)-4-(4-(2-(1-amino-3-methylbutyl)-4-(trifluoromethyl)phenyl)piperazin-1-yl)-N,N-dimethyl-4-oxobutanamide | CHEMBL379202
Type:
Small organic molecule
Emp. Form.:
C22H33F3N4O2
Mol. Mass.:
442.5182
SMILES:
CC(C)C[C@H](N)c1cc(ccc1N1CCN(CC1)C(=O)CCC(=O)N(C)C)C(F)(F)F
: