Target
Metabotropic glutamate receptor 7
Ligand
BDBM50060137
Substrate
Meas. Tech.
ChEMBL_400291 (CHEMBL912664)
EC50
1200000±n/a nM
Citation
 Schann, SMenet, CArvault, PMercier, GFrauli, MMayer, SHubert, NTriballeau, NBertrand, HOAcher, FNeuville, P Design and synthesis of APTCs (aminopyrrolidinetricarboxylic acids): identification of a new group III metabotropic glutamate receptor selective agonist. Bioorg Med Chem Lett 16:4856-60 (2006)  
Target
Name:
Metabotropic glutamate receptor 7
Synonyms:
GRM7_RAT Grm7 Metabotropic glutamate receptor 7 (mGlu7) mGlu7
Type:
Enzyme
Mol. Mass.:
102244.48
Organism:
Rattus norvegicus (Rat)
Description:
P35400
Residue:
915
  
Inhibitor
Name:
BDBM50060137
Synonyms:
(1R,2S)-4-aminocyclopentane-1,2,4-tricarboxylic acid (1S,2R,4S)-4-Amino-cyclopentane-1,2,4-tricarboxylic acid 4-Amino-cyclopentane-1,2,4-tricarboxylic acid | CHEMBL285043
Type:
Small organic molecule
Emp. Form.:
C8H11NO6
Mol. Mass.:
217.176
SMILES:
N[C@]1(C[C@@H]([C@@H](C1)C(O)=O)C(O)=O)C(O)=O
: