Target
Metabotropic glutamate receptor 5
Ligand
BDBM50191052
Substrate
Meas. Tech.
ChEMBL_400289 (CHEMBL912662)
EC50
>5000000±n/a nM
Citation
 Schann, SMenet, CArvault, PMercier, GFrauli, MMayer, SHubert, NTriballeau, NBertrand, HOAcher, FNeuville, P Design and synthesis of APTCs (aminopyrrolidinetricarboxylic acids): identification of a new group III metabotropic glutamate receptor selective agonist. Bioorg Med Chem Lett 16:4856-60 (2006)  
Target
Name:
Metabotropic glutamate receptor 5
Synonyms:
GRM5_RAT Grm5 Mglur5 metabotropic glutamate 5/1-C metabotropic glutamate 5a
Type:
Enzyme
Mol. Mass.:
131900.14
Organism:
Rattus norvegicus (Rat)
Description:
P31424
Residue:
1203
  
Inhibitor
Name:
BDBM50191052
Synonyms:
(2S,4S)-4-amino-1-((E)-3-carboxyacryloyl)pyrrolidine-2,4-dicarboxylic acid | CHEMBL212233
Type:
Small organic molecule
Emp. Form.:
C10H12N2O7
Mol. Mass.:
272.2115
SMILES:
N[C@]1(C[C@H](N(C1)C(=O)\C=C\C(O)=O)C(O)=O)C(O)=O
: