Target
Metabotropic glutamate receptor 5
Ligand
BDBM50191130
Substrate
Meas. Tech.
ChEMBL_397647 (CHEMBL856303)
IC50
174±n/a nM
Citation
 Bach, PNilsson, KSvensson, TBauer, UHammerland, LGPeterson, AWållberg, AOsterlund, KKaris, DBoije, MWensbo, D Structure-activity relationships for the linker in a series of pyridinyl-alkynes that are antagonists of the metabotropic glutamate receptor 5 (mGluR5). Bioorg Med Chem Lett 16:4788-91 (2006)  
Target
Name:
Metabotropic glutamate receptor 5
Synonyms:
GPRC1E GRM5_HUMAN metabotropic glutamate 5 | metabotropic glutamate 5a
Type:
Enzyme
Mol. Mass.:
132484.72
Organism:
Homo sapiens (Human)
Description:
Residue:
1212
  
Inhibitor
Name:
BDBM50191130
Synonyms:
3-chloro-N-(3-(6-methylpyridin-2-yl)prop-2-ynyl)benzenamine | CHEMBL214218
Type:
Small organic molecule
Emp. Form.:
C15H13ClN2
Mol. Mass.:
256.73
SMILES:
Cc1cccc(n1)C#CCNc1cccc(Cl)c1
: