Target
Melanocortin receptor 4
Ligand
BDBM50191552
Substrate
Meas. Tech.
ChEMBL_376973 (CHEMBL871434)
Ki
248±n/a nM
Citation
 Tian, XField, TBSwitzer, AGMazur, AWEbetino, FHWos, JABerberich, SMJayasinghe, LRObringer, CMDowty, MEPinney, BBFarmer, JACrossdoersen, DSheldon, RJ Design, synthesis, and evaluation of proline and pyrrolidine based melanocortin receptor agonists. A conformationally restricted dipeptide mimic approach. J Med Chem 49:4745-61 (2006)  
Target
Name:
Melanocortin receptor 4
Synonyms:
MC4-R MC4R_HUMAN Melanocortin receptor 4 (MC-4) Melanocortin receptor 4 (MC4R)
Type:
Enzyme
Mol. Mass.:
36949.50
Organism:
Homo sapiens (Human)
Description:
P32245
Residue:
332
  
Inhibitor
Name:
BDBM50191552
Synonyms:
(S)-2-acetamido-N-((R)-1-((2S,4S)-2-(3-guanidinopropyl)-4-(naphthalen-2-ylmethoxy)pyrrolidin-1-yl)-1-oxo-3-phenylpropan-2-yl)-3-(4-hydroxyphenyl)propanamide | CHEMBL380051
Type:
Small organic molecule
Emp. Form.:
C39H46N6O5
Mol. Mass.:
678.8197
SMILES:
[#6]-[#6](=O)-[#7]-[#6@@H](-[#6]-c1ccc(-[#8])cc1)-[#6](=O)-[#7]-[#6@H](-[#6]-c1ccccc1)-[#6](=O)-[#7]-1-[#6]-[#6@H](-[#6]-[#6@@H]-1-[#6]-[#6]-[#6]\[#7]=[#6](\[#7])-[#7])-[#8]-[#6]-c1ccc2ccccc2c1
: