Target
Melanocortin receptor 3
Ligand
BDBM50191569
Substrate
Meas. Tech.
ChEMBL_376972 (CHEMBL853375)
Ki
117±n/a nM
Citation
 Tian, XField, TBSwitzer, AGMazur, AWEbetino, FHWos, JABerberich, SMJayasinghe, LRObringer, CMDowty, MEPinney, BBFarmer, JACrossdoersen, DSheldon, RJ Design, synthesis, and evaluation of proline and pyrrolidine based melanocortin receptor agonists. A conformationally restricted dipeptide mimic approach. J Med Chem 49:4745-61 (2006)  
Target
Name:
Melanocortin receptor 3
Synonyms:
MC3-R MC3R_HUMAN Melanocortin receptor (M3 and M4)
Type:
Enzyme
Mol. Mass.:
36044.86
Organism:
Homo sapiens (Human)
Description:
P41968
Residue:
323
  
Inhibitor
Name:
BDBM50191569
Synonyms:
(S)-2-Acetamido-N-((R)-1-((2S,4S)-2-(3-guanidinopropyl)-4-(naphthalen-2-ylmethoxy)pyrrolidin-1-yl)-1-oxo-3-phenylpropan-2-yl)-3-(1H-imidazol-4-yl)propanamide | CHEMBL377465
Type:
Small organic molecule
Emp. Form.:
C36H44N8O4
Mol. Mass.:
652.7858
SMILES:
CC(=O)N[C@@H](Cc1cnc[nH]1)C(=O)N[C@H](Cc1ccccc1)C(=O)N1C[C@H](C[C@@H]1CCCN=C(N)N)OCc1ccc2ccccc2c1
: