Target
Melanocyte-stimulating hormone receptor
Ligand
BDBM50191561
Substrate
Meas. Tech.
ChEMBL_376971 (CHEMBL853374)
Ki
125±n/a nM
Citation
 Tian, XField, TBSwitzer, AGMazur, AWEbetino, FHWos, JABerberich, SMJayasinghe, LRObringer, CMDowty, MEPinney, BBFarmer, JACrossdoersen, DSheldon, RJ Design, synthesis, and evaluation of proline and pyrrolidine based melanocortin receptor agonists. A conformationally restricted dipeptide mimic approach. J Med Chem 49:4745-61 (2006)  
Target
Name:
Melanocyte-stimulating hormone receptor
Synonyms:
MC1-R MSH-R MSHR_HUMAN Melanocortin receptor (M1 and M4) Melanocortin receptor 1 (MC1-R) | Melanocortin receptor 1 (MC1R)
Type:
Enzyme
Mol. Mass.:
34717.23
Organism:
Homo sapiens (Human)
Description:
Q01726
Residue:
317
  
Inhibitor
Name:
BDBM50191561
Synonyms:
(S)-N-((R)-1-((2S,4S)-2-(3-guanidinopropyl)-4-(naphthalen-2-ylmethoxy)pyrrolidin-1-yl)-1-oxo-3-phenylpropan-2-yl)piperidine-2-carboxamide | CHEMBL210011
Type:
Small organic molecule
Emp. Form.:
C34H44N6O3
Mol. Mass.:
584.7516
SMILES:
[#7]\[#6](-[#7])=[#7]\[#6]-[#6]-[#6]-[#6@H]-1-[#6]-[#6@@H](-[#6]-[#7]-1-[#6](=O)-[#6@@H](-[#6]-c1ccccc1)-[#7]-[#6](=O)-[#6]-1-[#6]-[#6]-[#6]-[#6]-[#7]-1)-[#8]-[#6]-c1ccc2ccccc2c1
: