Target
Sodium/hydrogen exchanger 2
Ligand
BDBM50058759
Substrate
Meas. Tech.
ChEMBL_397781 (CHEMBL856312)
IC50
62000±n/a nM
Citation
 Atwal, KSO'Neil, SVAhmad, SDoweyko, LKirby, MDorso, CRChandrasena, GChen, BCZhao, RZahler, R Synthesis and biological activity of 5-aryl-4-(4-(5-methyl-1H-imidazol-4-yl)piperidin-1-yl)pyrimidine analogs as potent, highly selective, and orally bioavailable NHE-1 inhibitors. Bioorg Med Chem Lett 16:4796-9 (2006)  
Target
Name:
Sodium/hydrogen exchanger 2
Synonyms:
NHE-2 Na(+)/H(+) exchanger 2 SLC9A2 | Solute carrier family 9 member 2
Type:
PROTEIN
Mol. Mass.:
91542.38
Organism:
Homo sapiens (Human)
Description:
ChEMBL_397781
Residue:
812
  
Inhibitor
Name:
BDBM50058759
Synonyms:
CHEMBL436559 Cariporide N-(4-Isopropyl-3-methanesulfonyl-benzoyl)-guanidine(Cariporide) N-(diaminomethylene)-4-isopropyl-3-(methylsulfonyl)benzamide
Type:
Small organic molecule
Emp. Form.:
C12H17N3O3S
Mol. Mass.:
283.347
SMILES:
CC(C)c1ccc(cc1S(C)(=O)=O)C(=O)NC(N)=N
: