Target
Photoreceptor-specific nuclear receptor
Ligand
BDBM50192205
Substrate
Meas. Tech.
ChEMBL_401901 (CHEMBL906904)
EC50
1328±n/a nM
Citation
 Wolkenberg, SEZhao, ZKapitskaya, MWebber, ALPetrukhin, KTang, YSDean, DCHartman, GDLindsley, CW Identification of potent agonists of photoreceptor-specific nuclear receptor (NR2E3) and preparation of a radioligand. Bioorg Med Chem Lett 16:5001-4 (2006)  
Target
Name:
Photoreceptor-specific nuclear receptor
Synonyms:
NR2E3 PNR photoreceptor-specific nuclear receptor
Type:
PROTEIN
Mol. Mass.:
44699.83
Organism:
Homo sapiens (Human)
Description:
ChEMBL_401901
Residue:
410
  
Inhibitor
Name:
BDBM50192205
Synonyms:
2-chloro-N-(4-(5-(cyclobutanecarboxamido)-1H-benzo[d]imidazol-2-yl)phenyl)benzamide | CHEMBL214445
Type:
Small organic molecule
Emp. Form.:
C25H21ClN4O2
Mol. Mass.:
444.913
SMILES:
Clc1ccccc1C(=O)Nc1ccc(cc1)-c1nc2ccc(NC(=O)C3CCC3)cc2[nH]1
: