Target
Cannabinoid receptor 1
Ligand
BDBM50192588
Substrate
Meas. Tech.
ChEMBL_422302 (CHEMBL907003)
Ki
11±n/a nM
Citation
 Huffman, JWPadgett, LWIsherwood, MLWiley, JLMartin, BR 1-Alkyl-2-aryl-4-(1-naphthoyl)pyrroles: new high affinity ligands for the cannabinoid CB1 and CB2 receptors. Bioorg Med Chem Lett 16:5432-5 (2006)  
Target
Name:
Cannabinoid receptor 1
Synonyms:
Brain-type cannabinoid receptor CB-R CNR1_RAT Cannabinoid receptor Cnr1 | Skr6
Type:
G Protein-Coupled Receptor (GPCR)
Mol. Mass.:
52856.55
Organism:
Rattus norvegicus (rat)
Description:
P20272
Residue:
473
  
Inhibitor
Name:
BDBM50192588
Synonyms:
(1-hexyl-5-phenyl-1H-pyrrol-3-yl)(naphthalen-1-yl)methanone JWH-147
Type:
Small organic molecule
Emp. Form.:
C27H27NO
Mol. Mass.:
381.5094
SMILES:
CCCCCCn1cc(cc1-c1ccccc1)C(=O)c1cccc2ccccc12
: