Target
Cannabinoid receptor 1
Ligand
BDBM50192590
Substrate
Meas. Tech.
ChEMBL_422302 (CHEMBL907003)
Ki
404±n/a nM
Citation
 Huffman, JWPadgett, LWIsherwood, MLWiley, JLMartin, BR 1-Alkyl-2-aryl-4-(1-naphthoyl)pyrroles: new high affinity ligands for the cannabinoid CB1 and CB2 receptors. Bioorg Med Chem Lett 16:5432-5 (2006)  
Target
Name:
Cannabinoid receptor 1
Synonyms:
Brain-type cannabinoid receptor CB-R CNR1_RAT Cannabinoid receptor Cnr1 | Skr6
Type:
G Protein-Coupled Receptor (GPCR)
Mol. Mass.:
52856.55
Organism:
Rattus norvegicus (rat)
Description:
P20272
Residue:
473
  
Inhibitor
Name:
BDBM50192590
Synonyms:
CHEMBL217969 naphthalen-1-yl(5-phenyl-1-propyl-1H-pyrrol-3-yl)methanone
Type:
Small organic molecule
Emp. Form.:
C24H21NO
Mol. Mass.:
339.4296
SMILES:
CCCn1cc(cc1-c1ccccc1)C(=O)c1cccc2ccccc12
: