Target
Cannabinoid receptor 2
Ligand
BDBM50192598
Substrate
Meas. Tech.
ChEMBL_422303 (CHEMBL907004)
Ki
62±n/a nM
Citation
 Huffman, JWPadgett, LWIsherwood, MLWiley, JLMartin, BR 1-Alkyl-2-aryl-4-(1-naphthoyl)pyrroles: new high affinity ligands for the cannabinoid CB1 and CB2 receptors. Bioorg Med Chem Lett 16:5432-5 (2006)  
Target
Name:
Cannabinoid receptor 2
Synonyms:
CANNABINOID CB2 CB2 CB2B CNR2_HUMAN Cannabinoid CB2 receptor Cannabinoid receptor 2 (CB2R) | hCB2
Type:
G Protein-Coupled Receptor (GPCR)
Mol. Mass.:
39690.94
Organism:
Homo sapiens (Human)
Description:
P34972
Residue:
360
  
Inhibitor
Name:
BDBM50192598
Synonyms:
(1-heptyl-5-phenyl-1H-pyrrol-3-yl)(naphthalen-1-yl)methanone JWH-146
Type:
Small organic molecule
Emp. Form.:
C28H29NO
Mol. Mass.:
395.536
SMILES:
CCCCCCCn1cc(cc1-c1ccccc1)C(=O)c1cccc2ccccc12
: