Target
Cannabinoid receptor 2
Ligand
BDBM50192594
Substrate
Meas. Tech.
ChEMBL_422303 (CHEMBL907004)
Ki
64±n/a nM
Citation
 Huffman, JWPadgett, LWIsherwood, MLWiley, JLMartin, BR 1-Alkyl-2-aryl-4-(1-naphthoyl)pyrroles: new high affinity ligands for the cannabinoid CB1 and CB2 receptors. Bioorg Med Chem Lett 16:5432-5 (2006)  
Target
Name:
Cannabinoid receptor 2
Synonyms:
CANNABINOID CB2 CB2 CB2B CNR2_HUMAN Cannabinoid CB2 receptor Cannabinoid receptor 2 (CB2R) | hCB2
Type:
G Protein-Coupled Receptor (GPCR)
Mol. Mass.:
39690.94
Organism:
Homo sapiens (Human)
Description:
P34972
Residue:
360
  
Inhibitor
Name:
BDBM50192594
Synonyms:
(5-(4-butylphenyl)-1-pentyl-1H-pyrrol-3-yl)(naphthalen-1-yl)methanone JWH-371
Type:
Small organic molecule
Emp. Form.:
C30H33NO
Mol. Mass.:
423.5891
SMILES:
CCCCCn1cc(cc1-c1ccc(CCCC)cc1)C(=O)c1cccc2ccccc12
: