Target
11-beta-hydroxysteroid dehydrogenase type 2
Ligand
BDBM50192685
Substrate
Meas. Tech.
ChEMBL_422275 (CHEMBL855995)
IC50
1820±n/a nM
Citation
 Yeh, VSKurukulasuriya, RMadar, DPatel, JRFung, SMonzon, KChiou, WWang, JJacobson, PSham, HLLink, JT Synthesis and structural activity relationship of 11beta-HSD1 inhibitors with novel adamantane replacements. Bioorg Med Chem Lett 16:5408-13 (2006)  
Target
Name:
11-beta-hydroxysteroid dehydrogenase type 2
Synonyms:
11-DH2 11-beta-Hydroxysteroid Dehydrogenase 2 (11-beta-HSD2) Corticosteroid 11-beta-dehydrogenase isozyme 2 Hsd11b2 NAD-dependent 11-beta-hydroxysteroid dehydrogenase
Type:
Enzyme
Mol. Mass.:
42201.46
Organism:
Mus musculus (mouse)
Description:
Purified recombinant mouse 11beta-HSD2.
Residue:
386
  
Inhibitor
Name:
BDBM50192685
Synonyms:
(3s,9s)-9-(2-(4-chlorophenoxy)-2-methylpropanamido)bicyclo[3.3.1]nonane-3-carboxylic acid | CHEMBL386315
Type:
Small organic molecule
Emp. Form.:
C20H26ClNO4
Mol. Mass.:
379.878
SMILES:
CC(C)(Oc1ccc(Cl)cc1)C(=O)N[C@@H]1C2CCCC1C[C@H](C2)C(O)=O
: