Target
D(2) dopamine receptor
Ligand
BDBM50193289
Substrate
Meas. Tech.
ChEMBL_382040 (CHEMBL863653)
Ki
137±n/a nM
Citation
 Kolasa, TMatulenko, MAHakeem, AAPatel, MVMortell, KBhatia, PHenry, RNakane, MHsieh, GCTerranova, MAUchic, MEMiller, LNChang, RDonnelly-Roberts, DLNamovic, MTHollingsworth, PRMartino, BEl Kouhen, OMarsh, KCWetter, JMMoreland, RBBrioni, JDStewart, AO 1-aryl-3-(4-pyridine-2-ylpiperazin-1-yl)propan-1-one oximes as potent dopamine D4 receptor agonists for the treatment of erectile dysfunction. J Med Chem 49:5093-109 (2006)  
Target
Name:
D(2) dopamine receptor
Synonyms:
D(2) dopamine receptor DOPAMINE D2 Long DRD2 Dopamine D2 receptor Dopamine D2 receptor (D2R) Dopamine2-like | d2
Type:
Cell-surface receptors
Mol. Mass.:
50647.10
Organism:
Homo sapiens (Human)
Description:
P14416
Residue:
443
  
Inhibitor
Name:
BDBM50193289
Synonyms:
(E)-1-(3,4-dimethylphenyl)-3-(4-pyridin-2-ylpiperazin-1-yl)-propan-1-one O-methyloxime | CHEMBL212444
Type:
Small organic molecule
Emp. Form.:
C21H28N4O
Mol. Mass.:
352.4732
SMILES:
CO\N=C(/CCN1CCN(CC1)c1ccccn1)c1ccc(C)c(C)c1
: