Target
D(2) dopamine receptor
Ligand
BDBM50193311
Substrate
Meas. Tech.
ChEMBL_382040 (CHEMBL863653)
Ki
19.4±n/a nM
Citation
 Kolasa, TMatulenko, MAHakeem, AAPatel, MVMortell, KBhatia, PHenry, RNakane, MHsieh, GCTerranova, MAUchic, MEMiller, LNChang, RDonnelly-Roberts, DLNamovic, MTHollingsworth, PRMartino, BEl Kouhen, OMarsh, KCWetter, JMMoreland, RBBrioni, JDStewart, AO 1-aryl-3-(4-pyridine-2-ylpiperazin-1-yl)propan-1-one oximes as potent dopamine D4 receptor agonists for the treatment of erectile dysfunction. J Med Chem 49:5093-109 (2006)  
Target
Name:
D(2) dopamine receptor
Synonyms:
D(2) dopamine receptor DOPAMINE D2 Long DRD2 Dopamine D2 receptor Dopamine D2 receptor (D2R) Dopamine2-like | d2
Type:
Cell-surface receptors
Mol. Mass.:
50647.10
Organism:
Homo sapiens (Human)
Description:
P14416
Residue:
443
  
Inhibitor
Name:
BDBM50193311
Synonyms:
(Z)-1-(4-chlorophenyl)-3-(3',4',5',6'-tetrahydro-2'H-[2,4']bipyridinyl-1'-yl)propan-1-one O-methyloxime | CHEMBL437532
Type:
Small organic molecule
Emp. Form.:
C20H24ClN3O
Mol. Mass.:
357.877
SMILES:
CO\N=C(\CCN1CCC(CC1)c1ccccn1)c1ccc(Cl)cc1
: