Target
Melanin-concentrating hormone receptor 1
Ligand
BDBM50193634
Substrate
Meas. Tech.
ChEMBL_421232 (CHEMBL856554)
EC50
370±n/a nM
Citation
 Jiang, JLin, PHoang, MChang, LTan, CFeighner, SPalyha, OCHreniuk, DLPan, JSailer, AWMorin, NRMacNeil, DJHoward, ADVan der Ploeg, LHGoulet, MTDeVita, RJ 4-Aminoquinoline melanin-concentrating hormone 1-receptor (MCH1R) antagonists. Bioorg Med Chem Lett 16:5275-9 (2006)  
Target
Name:
Melanin-concentrating hormone receptor 1
Synonyms:
G-protein coupled receptor 24 MCH receptor 1 MCH-R1 MCHR-1 MCHR1_HUMAN Melanin-Concentrating Hormone Receptor 1 (MCH1R) Melanin-concentrating hormone receptor 1 (MCH-1) Melanin-concentrating hormone receptor 1 (MCHR-1) SLC-1 Somatostatin receptor-like protein
Type:
G Protein-Coupled Receptor (GPCR)
Mol. Mass.:
45976.27
Organism:
Homo sapiens (Human)
Description:
Membranes from CHO-K1 cells stably expressing human MCH1R were used in assays.
Residue:
422
  
Inhibitor
Name:
BDBM50193634
Synonyms:
CHEMBL214888 | N-(4-amino-2-propylquinolin-6-yl)-4-(4-chlorophenyl)cyclohexanecarboxamide
Type:
Small organic molecule
Emp. Form.:
C25H28ClN3O
Mol. Mass.:
421.962
SMILES:
CCCc1cc(N)c2cc(NC(=O)C3CCC(CC3)c3ccc(Cl)cc3)ccc2n1
: