Target
Sterol O-acyltransferase 2
Ligand
BDBM50193718
Substrate
Meas. Tech.
ChEMBL_424061 (CHEMBL855070)
IC50
41600±n/a nM
Citation
 Park, KHPark, YDHan, JMIm, KRLee, BWJeong, IYJeong, TSLee, WS Anti-atherosclerotic and anti-inflammatory activities of catecholic xanthones and flavonoids isolated from Cudrania tricuspidata. Bioorg Med Chem Lett 16:5580-3 (2006)  
Target
Name:
Sterol O-acyltransferase 2
Synonyms:
ACACT2 ACAT2 Acetyl-CoA transferase-like protein Cholesterol acyltransferase 2 SOAT2 | SOAT2_HUMAN
Type:
Enzyme
Mol. Mass.:
59912.75
Organism:
Homo sapiens (Human)
Description:
O75908
Residue:
522
  
Inhibitor
Name:
BDBM50193718
Synonyms:
2-(2,4-dihydroxy-phenyl)-5-hydroxy-8,8-dimethyl-3-(3-methyl-but-2-enyl)-8H-pyrano[3,2-g]chromen-4-one CHEMBL221907 cudraflavone B
Type:
Small organic molecule
Emp. Form.:
C25H24O6
Mol. Mass.:
420.4545
SMILES:
[#6]\[#6](-[#6])=[#6]\[#6]-c1c(oc2cc3-[#8]C([#6])([#6])[#6]=[#6]-c3c(-[#8])c2c1=O)-c1ccc(-[#8])cc1-[#8]
: