Target
Sterol O-acyltransferase 2
Ligand
BDBM50147178
Substrate
Meas. Tech.
ChEMBL_424061 (CHEMBL855070)
IC50
170±n/a nM
Citation
 Park, KHPark, YDHan, JMIm, KRLee, BWJeong, IYJeong, TSLee, WS Anti-atherosclerotic and anti-inflammatory activities of catecholic xanthones and flavonoids isolated from Cudrania tricuspidata. Bioorg Med Chem Lett 16:5580-3 (2006)  
Target
Name:
Sterol O-acyltransferase 2
Synonyms:
ACACT2 ACAT2 Acetyl-CoA transferase-like protein Cholesterol acyltransferase 2 SOAT2 | SOAT2_HUMAN
Type:
Enzyme
Mol. Mass.:
59912.75
Organism:
Homo sapiens (Human)
Description:
O75908
Residue:
522
  
Inhibitor
Name:
BDBM50147178
Synonyms:
(Z)-Octadec-9-enoic acid phenylamide oleic acid anilide
Type:
Small organic molecule
Emp. Form.:
C24H39NO
Mol. Mass.:
357.5726
SMILES:
CCCCCCCC\C=C/CCCCCCCC(=O)Nc1ccccc1
: