Target
Sterol O-acyltransferase 2
Ligand
BDBM50193721
Substrate
Meas. Tech.
ChEMBL_424061 (CHEMBL855070)
IC50
77600±n/a nM
Citation
 Park, KHPark, YDHan, JMIm, KRLee, BWJeong, IYJeong, TSLee, WS Anti-atherosclerotic and anti-inflammatory activities of catecholic xanthones and flavonoids isolated from Cudrania tricuspidata. Bioorg Med Chem Lett 16:5580-3 (2006)  
Target
Name:
Sterol O-acyltransferase 2
Synonyms:
ACACT2 ACAT2 Acetyl-CoA transferase-like protein Cholesterol acyltransferase 2 SOAT2 | SOAT2_HUMAN
Type:
Enzyme
Mol. Mass.:
59912.75
Organism:
Homo sapiens (Human)
Description:
O75908
Residue:
522
  
Inhibitor
Name:
BDBM50193721
Synonyms:
2-(2,4-dihydroxy-phenyl)-5-hydroxy-8,8-dimethyl-8H-pyrano[3,2-g]chromen-4-one CHEMBL221908
Type:
Small organic molecule
Emp. Form.:
C20H16O6
Mol. Mass.:
352.3374
SMILES:
CC1(C)Oc2cc3oc(cc(=O)c3c(O)c2C=C1)-c1ccc(O)cc1O
: