Target
Sterol O-acyltransferase 1
Ligand
BDBM50193722
Substrate
Meas. Tech.
ChEMBL_424060 (CHEMBL855069)
IC50
89600±n/a nM
Citation
 Park, KHPark, YDHan, JMIm, KRLee, BWJeong, IYJeong, TSLee, WS Anti-atherosclerotic and anti-inflammatory activities of catecholic xanthones and flavonoids isolated from Cudrania tricuspidata. Bioorg Med Chem Lett 16:5580-3 (2006)  
Target
Name:
Sterol O-acyltransferase 1
Synonyms:
ACACT ACAT Acetyl-CoA acetyltransferase, mitochondrial Acyl-CoA: cholesterol acyltransferase (ACAT) Cholesterol acyltransferase 1 SOAT1 STAT
Type:
Multi-pass membrane protein may form homo- or heterodimers.
Mol. Mass.:
64751.94
Organism:
Homo sapiens (Human)
Description:
P35610
Residue:
550
  
Inhibitor
Name:
BDBM50193722
Synonyms:
4-(2,4-dimethylpent-3-en-2-yl)-1,6,7-trihydroxy-3-methyl-9H-xanthen-9-one | CHEMBL218383
Type:
Small organic molecule
Emp. Form.:
C21H22O5
Mol. Mass.:
354.3964
SMILES:
[#6]\[#6](-[#6])=[#6]/C([#6])([#6])c1c(-[#6])cc(-[#8])c2c1oc1cc(-[#8])c(-[#8])cc1c2=O
: