Target
Proto-oncogene tyrosine-protein kinase Src
Ligand
BDBM50193880
Substrate
Meas. Tech.
ChEMBL_424208 (CHEMBL908982)
IC50
1800±n/a nM
Citation
 Noronha, GBarrett, KCao, JDneprovskaia, EFine, RGong, XGritzen, CHood, JKang, XKlebansky, BLi, GLiao, WLohse, DMak, CCMcPherson, APalanki, MSPathak, VPRenick, JSoll, RSplittgerber, UWrasidlo, WZeng, BZhao, NZhou, Y Discovery and preliminary structure-activity relationship studies of novel benzotriazine based compounds as Src inhibitors. Bioorg Med Chem Lett 16:5546-50 (2006)  
Target
Name:
Proto-oncogene tyrosine-protein kinase Src
Synonyms:
Calmodulin/Proto-oncogene tyrosine-protein kinase Src Proto-oncogene c-Src SRC SRC_HUMAN V-src sarcoma (Schmidt-Ruppin A-2) viral oncogene homolog (avian) p60-Src | pp60c-src
Type:
Protein
Mol. Mass.:
59838.60
Organism:
Homo sapiens (Human)
Description:
P12931
Residue:
536
  
Inhibitor
Name:
BDBM50193880
Synonyms:
CHEMBL218598 US8481536, 328
Type:
Small organic molecule
Emp. Form.:
C23H20N4O
Mol. Mass.:
368.4311
SMILES:
Cc1cccc(C)c1-c1cc(C)c2nc(NC(=O)c3ccccc3)nnc2c1
: