Target
Proto-oncogene tyrosine-protein kinase Src
Ligand
BDBM50193893
Substrate
Meas. Tech.
ChEMBL_424208 (CHEMBL908982)
IC50
>50000±n/a nM
Citation
 Noronha, GBarrett, KCao, JDneprovskaia, EFine, RGong, XGritzen, CHood, JKang, XKlebansky, BLi, GLiao, WLohse, DMak, CCMcPherson, APalanki, MSPathak, VPRenick, JSoll, RSplittgerber, UWrasidlo, WZeng, BZhao, NZhou, Y Discovery and preliminary structure-activity relationship studies of novel benzotriazine based compounds as Src inhibitors. Bioorg Med Chem Lett 16:5546-50 (2006)  
Target
Name:
Proto-oncogene tyrosine-protein kinase Src
Synonyms:
Calmodulin/Proto-oncogene tyrosine-protein kinase Src Proto-oncogene c-Src SRC SRC_HUMAN V-src sarcoma (Schmidt-Ruppin A-2) viral oncogene homolog (avian) p60-Src | pp60c-src
Type:
Protein
Mol. Mass.:
59838.60
Organism:
Homo sapiens (Human)
Description:
P12931
Residue:
536
  
Inhibitor
Name:
BDBM50193893
Synonyms:
7-mesityl-5-methyl-N-phenylbenzo[e][1,2,4]triazin-3-amine US8481536, 317
Type:
Small organic molecule
Emp. Form.:
C23H22N4
Mol. Mass.:
354.4476
SMILES:
Cc1cc(C)c(c(C)c1)-c1cc(C)c2nc(Nc3ccccc3)nnc2c1
: