Target
Proto-oncogene tyrosine-protein kinase Src
Ligand
BDBM50193903
Substrate
Meas. Tech.
ChEMBL_424208 (CHEMBL908982)
IC50
32±n/a nM
Citation
 Noronha, GBarrett, KCao, JDneprovskaia, EFine, RGong, XGritzen, CHood, JKang, XKlebansky, BLi, GLiao, WLohse, DMak, CCMcPherson, APalanki, MSPathak, VPRenick, JSoll, RSplittgerber, UWrasidlo, WZeng, BZhao, NZhou, Y Discovery and preliminary structure-activity relationship studies of novel benzotriazine based compounds as Src inhibitors. Bioorg Med Chem Lett 16:5546-50 (2006)  
Target
Name:
Proto-oncogene tyrosine-protein kinase Src
Synonyms:
Calmodulin/Proto-oncogene tyrosine-protein kinase Src Proto-oncogene c-Src SRC SRC_HUMAN V-src sarcoma (Schmidt-Ruppin A-2) viral oncogene homolog (avian) p60-Src | pp60c-src
Type:
Protein
Mol. Mass.:
59838.60
Organism:
Homo sapiens (Human)
Description:
P12931
Residue:
536
  
Inhibitor
Name:
BDBM50193903
Synonyms:
7-(2,6-dimethylphenyl)-N-(4-(2-ethoxymorpholino)phenyl)-5-methylbenzo[e][1,2,4]triazin-3-amine | CHEMBL434578
Type:
Small organic molecule
Emp. Form.:
C28H31N5O2
Mol. Mass.:
469.578
SMILES:
CCOC1CN(CCO1)c1ccc(Nc2nnc3cc(cc(C)c3n2)-c2c(C)cccc2C)cc1
: