Target
Acetylcholinesterase
Ligand
BDBM9047
Substrate
Meas. Tech.
ChEMBL_403196 (CHEMBL869256)
IC50
3.8±n/a nM
Citation
 Rydberg, EHBrumshtein, BGreenblatt, HMWong, DMShaya, DWilliams, LDCarlier, PRPang, YPSilman, ISussman, JL Complexes of alkylene-linked tacrine dimers with Torpedo californica acetylcholinesterase: Binding of Bis5-tacrine produces a dramatic rearrangement in the active-site gorge. J Med Chem 49:5491-500 (2006)  
Target
Name:
Acetylcholinesterase
Synonyms:
ACES_RAT Acetylcholinesterase and butyrylcholinesterase (AChE and BChE) Acetylcholinesterase, AChE | Ache
Type:
Enzyme
Mol. Mass.:
68193.62
Organism:
Rattus norvegicus (rat)
Description:
P37136
Residue:
614
  
Inhibitor
Name:
BDBM9047
Synonyms:
Bis-THA inhibitor 5 Hexylene-Linked Bis-tacrine N-[6-(1,2,3,4-tetrahydroacridin-9-ylamino)hexyl]-1,2,3,4-tetrahydroacridin-9-amine
Type:
Small organic molecule
Emp. Form.:
C32H38N4
Mol. Mass.:
478.6709
SMILES:
C(CCCNc1c2CCCCc2nc2ccccc12)CCNc1c2CCCCc2nc2ccccc12
: