Target
Kappa-type opioid receptor
Ligand
BDBM50194400
Substrate
Meas. Tech.
ChEMBL_424357 (CHEMBL909560)
Ki
>1000±n/a nM
Citation
 Lee, DYHe, MLiu-Chen, LYWang, YLi, JGXu, WMa, ZCarlezon, WACohen, B Synthesis and in vitro pharmacological studies of new C(4)-modified salvinorin A analogues. Bioorg Med Chem Lett 16:5498-502 (2006)  
Target
Name:
Kappa-type opioid receptor
Synonyms:
K-OR-1 Kappa-opioid receptor (KOR) Kappa-type opioid receptor (KOR) OPIATE Kappa OPRK1 kappa opioid receptor (KOR)
Type:
G Protein-Coupled Receptor (GPCR)
Mol. Mass.:
42648.76
Organism:
Homo sapiens (Human)
Description:
P41145
Residue:
380
  
Inhibitor
Name:
BDBM50194400
Synonyms:
(2S,4aR,6aS,7R,9S,10aS,10bR)-2-(furan-3-yl)-7-(methoxymethyl)-6a,10b-dimethyl-4,10-dioxo-dodecahydro-1H-benzo[f]isochromen-9-yl acetate | CHEMBL218140
Type:
Small organic molecule
Emp. Form.:
C23H30O7
Mol. Mass.:
418.4801
SMILES:
COC[C@@H]1C[C@H](OC(C)=O)C(=O)[C@H]2[C@@]1(C)CC[C@H]1C(=O)O[C@@H](C[C@]21C)c1ccoc1
: