Target
Kappa-type opioid receptor
Ligand
BDBM50194406
Substrate
Meas. Tech.
ChEMBL_424357 (CHEMBL909560)
Ki
613±n/a nM
Citation
 Lee, DYHe, MLiu-Chen, LYWang, YLi, JGXu, WMa, ZCarlezon, WACohen, B Synthesis and in vitro pharmacological studies of new C(4)-modified salvinorin A analogues. Bioorg Med Chem Lett 16:5498-502 (2006)  
Target
Name:
Kappa-type opioid receptor
Synonyms:
K-OR-1 Kappa-opioid receptor (KOR) Kappa-type opioid receptor (KOR) OPIATE Kappa OPRK1 kappa opioid receptor (KOR)
Type:
G Protein-Coupled Receptor (GPCR)
Mol. Mass.:
42648.76
Organism:
Homo sapiens (Human)
Description:
P41145
Residue:
380
  
Inhibitor
Name:
BDBM50194406
Synonyms:
(2-methoxy-ethoxy)-acetic acid (3S,4aR,4bS,6S,8R,8aS,10aR)-6-acetoxy-3-furan-3-yl-4a,8a-dimethyl-1,5-dioxo-dodecahydro-2-oxa-phenanthren-8-ylmethyl ester | CHEMBL217971
Type:
Small organic molecule
Emp. Form.:
C27H36O10
Mol. Mass.:
520.5687
SMILES:
COCCOCC(=O)OC[C@@H]1C[C@H](OC(C)=O)C(=O)[C@H]2[C@@]1(C)CC[C@H]1C(=O)O[C@@H](C[C@]21C)c1ccoc1
: