Target
Mu-type opioid receptor
Ligand
BDBM50194488
Substrate
Meas. Tech.
ChEMBL_424403 (CHEMBL911334)
Ki
0.051±n/a nM
Citation
 Shiotani, KLi, TMiyazaki, ATsuda, YBryant, SDAmbo, ASasaki, YLazarus, LHOkada, Y Synthesis of 3,6-bis[H-Tyr/H-Dmt-NH(CH2)m,n]-2(1H)pyrazinone derivatives: function of alkyl chain length on opioid activity. Bioorg Med Chem Lett 16:5793-6 (2006)  
Target
Name:
Mu-type opioid receptor
Synonyms:
MOR-1 Mu-type opioid receptor (MOR) OPRM_RAT Opioid receptor B Ror-b
Type:
G Protein-Coupled Receptor (GPCR)
Mol. Mass.:
44503.11
Organism:
Rattus norvegicus (rat)
Description:
Competition binding assays were carried out using membrane preparations from transfected HN9.10 cells that constitutively expressed the mu opioid receptor.
Residue:
398
  
Inhibitor
Name:
BDBM50194488
Synonyms:
6-[4'-(H-Dmt)-aminobutyl]-3-[3'-(H-Dmt)-aminopropyl]-5-methyl-2(1H)-pyrazinone | CHEMBL385779
Type:
Small organic molecule
Emp. Form.:
C34H48N6O5
Mol. Mass.:
620.7821
SMILES:
Cc1cc(O)cc(C)c1C[C@H](N)C(=O)NCCCCc1[nH]c(=O)c(CCCNC(=O)[C@@H](N)Cc2c(C)cc(O)cc2C)nc1C
: