Target
Potassium voltage-gated channel subfamily A member 5
Ligand
BDBM50194512
Substrate
Meas. Tech.
ChEMBL_422064 (CHEMBL907690)
IC50
94±n/a nM
Citation
 Nanda, KKNolt, MBCato, MJKane, SAKiss, LSpencer, RHWang, JLynch, JJRegan, CPStump, GLLi, BWhite, RYeh, SBogusky, MJBilodeau, MTDinsmore, CJLindsley, CWHartman, GDWolkenberg, SETrotter, BW Potent antagonists of the Kv1.5 potassium channel: synthesis and evaluation of analogous N,N-diisopropyl-2-(pyridine-3-yl)acetamides. Bioorg Med Chem Lett 16:5897-901 (2006)  
Target
Name:
Potassium voltage-gated channel subfamily A member 5
Synonyms:
HK2 KCNA5 Potassium voltage-gated channel subfamily A member 5 Voltage-gated potassium channel subunit Kv1.5
Type:
Enzyme
Mol. Mass.:
67222.47
Organism:
Homo sapiens (Human)
Description:
P22460
Residue:
613
  
Inhibitor
Name:
BDBM50194512
Synonyms:
CHEMBL216955 | N,N-diisopropyl-3-phenyl-4-(3-phenylbutanamido)-2-(pyridin-3-yl)butanamide
Type:
Small organic molecule
Emp. Form.:
C31H39N3O2
Mol. Mass.:
485.6603
SMILES:
CC(C)N(C(C)C)C(=O)C(C(CNC(=O)CC(C)c1ccccc1)c1ccccc1)c1cccnc1
: