Target
Gag-Pol polyprotein [489-587]
Ligand
BDBM50194731
Substrate
Meas. Tech.
ChEMBL_399771 (CHEMBL910306)
Ki
0.02±n/a nM
Citation
 Skalova, TDohnalek, JDuskova, JPetrokova, HHradílek, MSoucek, MKonvalinka, JHasek, J HIV-1 protease mutations and inhibitor modifications monitored on a series of complexes. Structural basis for the effect of the A71V mutation on the active site. J Med Chem 49:5777-84 (2006)  
Target
Name:
Gag-Pol polyprotein [489-587]
Synonyms:
Human immunodeficiency virus type 1 protease Pol polyprotein | gag-pol
Type:
Enzyme Subunit
Mol. Mass.:
10781.16
Organism:
Human immunodeficiency virus type 1
Description:
P04585[489-587]
Residue:
99
  
Inhibitor
Name:
BDBM50194731
Synonyms:
Boc-Phe-psi[S-CH(OH)CH2]Phe-Gln-Phe-NH2 | CHEMBL263978
Type:
Small organic molecule
Emp. Form.:
C38H49N5O7
Mol. Mass.:
687.825
SMILES:
CC(C)(C)OC(=O)N[C@@H](Cc1ccccc1)[C@@H](O)C[C@@H](Cc1ccccc1)C(=O)N[C@@H](CCC(N)=O)C(=O)N[C@@H](Cc1ccccc1)C(N)=O
: