Target
5-hydroxytryptamine receptor 2A
Ligand
BDBM50194749
Substrate
Meas. Tech.
ChEMBL_399258 (CHEMBL855891)
Ki
170±n/a nM
Citation
 McLean, THParrish, JCBraden, MRMarona-Lewicka, DGallardo-Godoy, ANichols, DE 1-Aminomethylbenzocycloalkanes: conformationally restricted hallucinogenic phenethylamine analogues as functionally selective 5-HT2A receptor agonists. J Med Chem 49:5794-803 (2006)  
Target
Name:
5-hydroxytryptamine receptor 2A
Synonyms:
5-HT-2 5-HT2A 5-hydroxytryptamine receptor 2A (5HT-2A) 5HT2A_HUMAN HTR2A | Serotonin receptor 2A
Type:
undefined
Mol. Mass.:
52607.65
Organism:
Homo sapiens (Human)
Description:
P28223
Residue:
471
  
Inhibitor
Name:
BDBM50194749
Synonyms:
C-(3-bromo-5-methoxy-1,6,7,8,9,9a-hexahydro-2-oxabenzo-[cd]azulen-6-yl)methylamine | CHEMBL213612
Type:
Small organic molecule
Emp. Form.:
C14H18BrNO2
Mol. Mass.:
312.202
SMILES:
COc1cc(Br)c2OC[C@H]3CCC[C@H](CN)c1c23
: