Target
Histone deacetylase 2b
Ligand
BDBM50195614
Substrate
Meas. Tech.
ChEMBL_416717 (CHEMBL909983)
IC50
32±n/a nM
Citation
 Mai, AMassa, SRotili, DSimeoni, SRagno, RBotta, GNebbioso, AMiceli, MAltucci, LBrosch, G Synthesis and biological properties of novel, uracil-containing histone deacetylase inhibitors. J Med Chem 49:6046-56 (2006)  
Target
Name:
Histone deacetylase 2b
Synonyms:
Histone deacetylase HD2
Type:
PROTEIN
Mol. Mass.:
30785.07
Organism:
Zea mays
Description:
ChEMBL_87549
Residue:
286
  
Inhibitor
Name:
BDBM50195614
Synonyms:
CHEMBL216064 | N-hydroxy-6-[(3,4-dihydro-4-oxo-6-(1-phenylpropyl)-2-pyrimidinylthio]hexanamide
Type:
Small organic molecule
Emp. Form.:
C19H25N3O3S
Mol. Mass.:
375.485
SMILES:
CCC(c1ccccc1)c1cc(=O)[nH]c(SCCCCCC(=O)NO)n1
: