Target
Alpha-2C adrenergic receptor
Ligand
BDBM50196117
Substrate
Meas. Tech.
ChEMBL_406590 (CHEMBL907694)
Ki
4.9±n/a nM
Citation
 Höglund, IPSilver, SEngström, MTSalo, HTauber, AKyyrönen, HKSaarenketo, PHoffrén, AMKokko, KPohjanoksa, KSallinen, JSavola, JMWurster, SKallatsa, OA Structure-activity relationship of quinoline derivatives as potent and selective alpha(2C)-adrenoceptor antagonists. J Med Chem 49:6351-63 (2006)  
Target
Name:
Alpha-2C adrenergic receptor
Synonyms:
ADA2C_HUMAN ADRA2L2 Adrenergic alpha2C Adrenergic receptor alpha Alpha-2 adrenergic receptor subtype C4 Alpha-2C adrenoreceptor | adrenergic, alpha-2C-, receptor [Homo sapiens]
Type:
Enzyme
Mol. Mass.:
49552.32
Organism:
Homo sapiens (Human)
Description:
P18825
Residue:
462
  
Inhibitor
Name:
BDBM50196117
Synonyms:
1-{4-[4-(3,4-dimethylpiperazin-1-yl)phenylamino]-2-methylquinolin-3-yl}ethanol | CHEMBL217253
Type:
Small organic molecule
Emp. Form.:
C24H30N4O
Mol. Mass.:
390.5212
SMILES:
CC(O)c1c(C)nc2ccccc2c1Nc1ccc(cc1)N1CCN(C)C(C)C1
: