Target
Alpha-2A adrenergic receptor
Ligand
BDBM50196143
Substrate
Meas. Tech.
ChEMBL_406588 (CHEMBL856624)
Ki
630±n/a nM
Citation
 Höglund, IPSilver, SEngström, MTSalo, HTauber, AKyyrönen, HKSaarenketo, PHoffrén, AMKokko, KPohjanoksa, KSallinen, JSavola, JMWurster, SKallatsa, OA Structure-activity relationship of quinoline derivatives as potent and selective alpha(2C)-adrenoceptor antagonists. J Med Chem 49:6351-63 (2006)  
Target
Name:
Alpha-2A adrenergic receptor
Synonyms:
ADA2A_HUMAN ADRA2R Adrenergic alpha2A Alpha-2 adrenergic receptor subtype C10 Alpha-2A adrenoreceptor alpha-2A adrenergic receptor [Homo sapiens]
Type:
Enzyme
Mol. Mass.:
48979.91
Organism:
Homo sapiens (Human)
Description:
P08913
Residue:
450
  
Inhibitor
Name:
BDBM50196143
Synonyms:
4-(3,4-dimethylpiperazin-1-yl)phenyl]-(3-ethyl-2-methyl-5,6,7,8-tetrahydroquinolin-4-yl)amine | CHEMBL217768
Type:
Small organic molecule
Emp. Form.:
C24H34N4
Mol. Mass.:
378.5536
SMILES:
CCc1c(C)nc2CCCCc2c1Nc1ccc(cc1)N1CCN(C)C(C)C1
: