Target
Alpha-2C adrenergic receptor
Ligand
BDBM50196120
Substrate
Meas. Tech.
ChEMBL_406590 (CHEMBL907694)
Ki
16±n/a nM
Citation
 Höglund, IPSilver, SEngström, MTSalo, HTauber, AKyyrönen, HKSaarenketo, PHoffrén, AMKokko, KPohjanoksa, KSallinen, JSavola, JMWurster, SKallatsa, OA Structure-activity relationship of quinoline derivatives as potent and selective alpha(2C)-adrenoceptor antagonists. J Med Chem 49:6351-63 (2006)  
Target
Name:
Alpha-2C adrenergic receptor
Synonyms:
ADA2C_HUMAN ADRA2L2 Adrenergic alpha2C Adrenergic receptor alpha Alpha-2 adrenergic receptor subtype C4 Alpha-2C adrenoreceptor | adrenergic, alpha-2C-, receptor [Homo sapiens]
Type:
Enzyme
Mol. Mass.:
49552.32
Organism:
Homo sapiens (Human)
Description:
P18825
Residue:
462
  
Inhibitor
Name:
BDBM50196120
Synonyms:
CHEMBL216727 | [4-(3,4-dimethylpiperazin-1-yl)phenyl]-(6-fluoro-2,3-dimethylquinolin-4-yl)amine
Type:
Small organic molecule
Emp. Form.:
C23H27FN4
Mol. Mass.:
378.4857
SMILES:
CC1CN(CCN1C)c1ccc(Nc2c(C)c(C)nc3ccc(F)cc23)cc1
: