Target
D(1A) dopamine receptor
Ligand
BDBM50088341
Substrate
Meas. Tech.
ChEMBL_417944 (CHEMBL912404)
Ki
60.4±n/a nM
Citation
 Enzensperger, CLehmann, J Dopamine/serotonin receptor ligands. 13: Homologization of a benzindoloazecine-type dopamine receptor antagonist modulates the affinities for dopamine D(1)-D(5) receptors. J Med Chem 49:6408-11 (2006)  
Target
Name:
D(1A) dopamine receptor
Synonyms:
DA D1 receptor DRD1 Dopamine D1 receptor Dopamine D1A
Type:
Enzyme
Mol. Mass.:
49303.43
Organism:
Homo sapiens (Human)
Description:
P21728
Residue:
446
  
Inhibitor
Name:
BDBM50088341
Synonyms:
11-methyl-11,21-diazatetracyclo[12.7.0.0^{3,8}.0^{15,20}]henicosa-1(14),3(8),4,6,15,17,19-heptaene 7-methyl-6,7,8,9,14,15-hexahydro-5H-benzo[7,8]azecino[5,4-b]indole(LE 300) CHEMBL441618 | LE 300
Type:
Small organic molecule
Emp. Form.:
C20H22N2
Mol. Mass.:
290.4021
SMILES:
CN1CCc2c(Cc3ccccc3CC1)[nH]c1ccccc21
: