Target
D(2) dopamine receptor
Ligand
BDBM50196234
Substrate
Meas. Tech.
ChEMBL_417945 (CHEMBL912405)
Ki
1.5±n/a nM
Citation
 Enzensperger, CLehmann, J Dopamine/serotonin receptor ligands. 13: Homologization of a benzindoloazecine-type dopamine receptor antagonist modulates the affinities for dopamine D(1)-D(5) receptors. J Med Chem 49:6408-11 (2006)  
Target
Name:
D(2) dopamine receptor
Synonyms:
D(2) dopamine receptor DOPAMINE D2 Long DRD2 Dopamine D2 receptor Dopamine D2 receptor (D2R) Dopamine2-like | d2
Type:
Cell-surface receptors
Mol. Mass.:
50647.10
Organism:
Homo sapiens (Human)
Description:
P14416
Residue:
443
  
Inhibitor
Name:
BDBM50196234
Synonyms:
8-methyl-5,6,7,8,9,10,15,16-octahydroindolo[3,2-g][4]benzazacycloundecine | CHEMBL216258
Type:
Small organic molecule
Emp. Form.:
C21H24N2
Mol. Mass.:
304.4287
SMILES:
CN1CCCc2ccccc2Cc2[nH]c3ccccc3c2CC1
: