Target
D(3) dopamine receptor
Ligand
BDBM50196235
Substrate
Meas. Tech.
ChEMBL_417941 (CHEMBL912401)
Ki
521±n/a nM
Citation
 Enzensperger, CLehmann, J Dopamine/serotonin receptor ligands. 13: Homologization of a benzindoloazecine-type dopamine receptor antagonist modulates the affinities for dopamine D(1)-D(5) receptors. J Med Chem 49:6408-11 (2006)  
Target
Name:
D(3) dopamine receptor
Synonyms:
DOPAMINE D3 DRD3_HUMAN Dopamine D3 receptor (D3) Dopamine receptor Dopamine receptor D3
Type:
Mol. Mass.:
44243.43
Organism:
Homo sapiens (Human)
Description:
Residue:
400
  
Inhibitor
Name:
BDBM50196235
Synonyms:
7-methyl-5,6,7,8,9,10,15,16-octahydroindolo[3,2-g][3]benzazacycloundecine | CHEMBL216439
Type:
Small organic molecule
Emp. Form.:
C21H24N2
Mol. Mass.:
304.4287
SMILES:
CN1CCCc2c(Cc3ccccc3CC1)[nH]c1ccccc21
: