Target
Adenosine receptor A3
Ligand
BDBM50196553
Substrate
Meas. Tech.
ChEMBL_440719 (CHEMBL889816)
Ki
92±n/a nM
Citation
 Elzein, EKalla, RLi, XPerry, TMarquart, TMicklatcher, MLi, YWu, YZeng, DZablocki, J N6-Cycloalkyl-2-substituted adenosine derivatives as selective, high affinity adenosine A1 receptor agonists. Bioorg Med Chem Lett 17:161-6 (2006)  
Target
Name:
Adenosine receptor A3
Synonyms:
A3 adenosine receptor (hA3) ADORA3 | Adenosine A3 receptor (A3AR)
Type:
G Protein-Coupled Receptor (GPCR)
Mol. Mass.:
36197.32
Organism:
Homo sapiens (Human)
Description:
P0DMS8
Residue:
318
  
Inhibitor
Name:
BDBM50196553
Synonyms:
CHEMBL393295 | ethyl 4-((1-(9-((2R,3R,4S,5R)-3,4-dihydroxy-5-(hydroxymethyl)-tetrahydrofuran-2-yl)-6-((R)-tetrahydrofuran-2-ylamino)-9H-purin-2-yl)-1H-pyrazole-4-carboxamido)methyl)benzoate
Type:
Small organic molecule
Emp. Form.:
C28H32N8O8
Mol. Mass.:
608.6025
SMILES:
CCOC(=O)c1ccc(CNC(=O)c2cnn(c2)-c2nc(N[C@H]3CCCO3)c3ncn([C@@H]4O[C@H](CO)[C@@H](O)[C@H]4O)c3n2)cc1
: