Target
Beta-secretase 1
Ligand
BDBM50196741
Substrate
Meas. Tech.
ChEMBL_440733 (CHEMBL889830)
EC50
6±n/a nM
Citation
 Freskos, JNFobian, YMBenson, TEMoon, JBBienkowski, MJBrown, DLEmmons, TLHeintz, RLaborde, AMcDonald, JJMischke, BVMolyneaux, JMMullins, PBBryan Prince, DPaddock, DJTomasselli, AGWinterrowd, G Design of potent inhibitors of human beta-secretase. Part 2. Bioorg Med Chem Lett 17:78-81 (2006)  
Target
Name:
Beta-secretase 1
Synonyms:
ASP2 Aspartyl protease 2 BACE1 Beta-secretase (BACE) Beta-secretase 1 (BACE 1) Beta-secretase 1 (BACE1) Beta-site amyloid precursor protein cleaving enzyme 1 Memapsin-2 beta-Secretase (BACE-1) | beta-Secretase (BACE1)
Type:
Protein
Mol. Mass.:
55755.10
Organism:
Homo sapiens (Human)
Description:
P56817
Residue:
501
  
Inhibitor
Name:
BDBM50196741
Synonyms:
(S)-N-((2S,3R)-4-(3-ethylbenzylamino)-1-(3,5-difluorophenyl)-3-hydroxybutan-2-yl)-2-acetamido-3-(butylsulfonyl)propanamide | CHEMBL232490
Type:
Small organic molecule
Emp. Form.:
C28H39F2N3O5S
Mol. Mass.:
567.688
SMILES:
CCCCS(=O)(=O)C[C@@H](NC(C)=O)C(=O)N[C@@H](Cc1cc(F)cc(F)c1)[C@H](O)CNCc1cccc(CC)c1
: