Target
Sodium-dependent serotonin transporter
Ligand
BDBM50198596
Substrate
Meas. Tech.
ChEMBL_440969 (CHEMBL890059)
Ki
2.2±n/a nM
Citation
 Keith, JMGomez, LALetavic, MALy, KSJablonowski, JASeierstad, MBarbier, AJWilson, SJBoggs, JDFraser, ICMazur, CLovenberg, TWCarruthers, NI Dual serotonin transporter/histamine H3 ligands: Optimization of the H3 pharmacophore. Bioorg Med Chem Lett 17:702-6 (2007)  
Target
Name:
Sodium-dependent serotonin transporter
Synonyms:
5-HT Transporter 5HT transporter Anandamid membrane transporter, AMT Monoamine transporters; Norepinephrine & serotonin Slc6a4 Sodium-dependent serotonin transporter (SERT) | imipramine receptor
Type:
Multi-pass membrane protein
Mol. Mass.:
70168.43
Organism:
Rattus norvegicus (rat)
Description:
P31652
Residue:
630
  
Inhibitor
Name:
BDBM50198596
Synonyms:
CHEMBL427845 | N,N-diethyl-3-(4-(4-methoxyphenyl)-2-methyl-1,2,3,4-tetrahydroisoquinolin-7-yloxy)propan-1-amine
Type:
Small organic molecule
Emp. Form.:
C24H34N2O2
Mol. Mass.:
382.539
SMILES:
CCN(CC)CCCOc1ccc2C(CN(C)Cc2c1)c1ccc(OC)cc1
: