Target
Sodium-dependent serotonin transporter
Ligand
BDBM50198611
Substrate
Meas. Tech.
ChEMBL_440970 (CHEMBL890060)
Ki
8.2±n/a nM
Citation
 Keith, JMGomez, LALetavic, MALy, KSJablonowski, JASeierstad, MBarbier, AJWilson, SJBoggs, JDFraser, ICMazur, CLovenberg, TWCarruthers, NI Dual serotonin transporter/histamine H3 ligands: Optimization of the H3 pharmacophore. Bioorg Med Chem Lett 17:702-6 (2007)  
Target
Name:
Sodium-dependent serotonin transporter
Synonyms:
5-HT Transporter 5HTT SC6A4_HUMAN SLC6A4 Serotonin transporter (5HTT) Sodium-dependent serotonin transporter (SERT) | Solute carrier family 6 member 4
Type:
Multi-pass membrane protein
Mol. Mass.:
70322.51
Organism:
Homo sapiens (Human)
Description:
P31645
Residue:
630
  
Inhibitor
Name:
BDBM50198611
Synonyms:
7-(3-(3,3-difluoropiperidin-1-yl)propoxy)-4-(4-methoxyphenyl)-2-methyl-1,2,3,4-tetrahydroisoquinoline | CHEMBL233470
Type:
Small organic molecule
Emp. Form.:
C25H32F2N2O2
Mol. Mass.:
430.5306
SMILES:
COc1ccc(cc1)C1CN(C)Cc2cc(OCCCN3CCCC(F)(F)C3)ccc12
: