Target
Melanin-concentrating hormone receptor 1
Ligand
BDBM50199254
Substrate
Meas. Tech.
ChEMBL_411789 (CHEMBL908945)
IC50
0.91±n/a nM
Citation
 Tavares, FXAl-Barazanji, KABishop, MJBritt, CSCarlton, DLCooper, JPFeldman, PLGarrido, DMGoetz, ASGrizzle, MKHertzog, DLIgnar, DMLang, DGMcIntyre, MSOtt, RJPeat, AJZhou, HQ 6-(4-chlorophenyl)-3-substituted-thieno[3,2-d]pyrimidin-4(3H)-one-based melanin-concentrating hormone receptor 1 antagonist. J Med Chem 49:7108-18 (2006)  
Target
Name:
Melanin-concentrating hormone receptor 1
Synonyms:
G-protein coupled receptor 24 MCH receptor 1 MCH-R1 MCHR-1 MCHR1_HUMAN Melanin-Concentrating Hormone Receptor 1 (MCH1R) Melanin-concentrating hormone receptor 1 (MCH-1) Melanin-concentrating hormone receptor 1 (MCHR-1) SLC-1 Somatostatin receptor-like protein
Type:
G Protein-Coupled Receptor (GPCR)
Mol. Mass.:
45976.27
Organism:
Homo sapiens (Human)
Description:
Membranes from CHO-K1 cells stably expressing human MCH1R were used in assays.
Residue:
422
  
Inhibitor
Name:
BDBM50199254
Synonyms:
6-(4-chlorophenyl)-3-[2-(1-pyrrolidinylmethyl)-1-benzothien-5-yl]thieno[3,2-d]pyrimidin-4(3H)-one | CHEMBL384133
Type:
Small organic molecule
Emp. Form.:
C25H20ClN3OS2
Mol. Mass.:
478.029
SMILES:
Clc1ccc(cc1)-c1cc2ncn(-c3ccc4sc(CN5CCCC5)cc4c3)c(=O)c2s1
: