Target
Adenosine receptor A1
Ligand
BDBM50199290
Substrate
Meas. Tech.
ChEMBL_412199 (CHEMBL908894)
Ki
4±n/a nM
Citation
 Vu, CBKiesman, WFConlon, PRLin, KCTam, MPetter, RCSmits, GLutterodt, FJin, XChen, LZhang, J Tricyclic imidazoline derivatives as potent and selective adenosine A1 receptor antagonists. J Med Chem 49:7132-9 (2006)  
Target
Name:
Adenosine receptor A1
Synonyms:
AA1R_RAT ADENOSINE A1 high Adenosine A1 receptor (A1) Adenosine receptors A1 | Adora1
Type:
Protein
Mol. Mass.:
36704.13
Organism:
Rattus norvegicus (rat)
Description:
Residue:
326
  
Inhibitor
Name:
BDBM50199290
Synonyms:
(R)-2-(4-hydroxybicyclo[2.2.2]octan-1-yl)-8-isopropyl-4-propyl-7,8-dihydro-1H-imidazo[1,2-g]purin-5(4H)-one | CHEMBL216269
Type:
Small organic molecule
Emp. Form.:
C21H31N5O2
Mol. Mass.:
385.5031
SMILES:
CCCn1c2nc(nc2c2N[C@@H](Cn2c1=O)C(C)C)C12CCC(O)(CC1)CC2
: